Target
Cyclin-T1/Cyclin-dependent kinase 9
Ligand
BDBM50425008
Substrate
Meas. Tech.
ChEMBL_936301 (CHEMBL2320999)
Ki
7±n/a nM
Citation
 Hole, AJBaumli, SShao, HShi, SHuang, SPepper, CFischer, PMWang, SEndicott, JANoble, ME Comparative structural and functional studies of 4-(thiazol-5-yl)-2-(phenylamino)pyrimidine-5-carbonitrile CDK9 inhibitors suggest the basis for isotype selectivity. J Med Chem 56:660-70 (2013)  
Target
Name:
Cyclin-T1/Cyclin-dependent kinase 9
Synonyms:
CDK9/ Cyclin-T1 CDK9/Cyclin T Cyclin T1/dependent kinase 9 | Cyclin-Dependent Kinase 9 (CDK9)
Type:
Protein Complex
Mol. Mass.:
Description:
Components:
This complex has 2 components.
Component 1
Name:
Cyclin-T1
Synonyms:
CCNT1 CycT Cyclin T Cyclin-T
Type:
Enzyme Subunit
Mol. Mass.:
80712.40
Organism:
Homo sapiens (Human)
Description:
Residue:
726
  
Component 2
Name:
Cyclin-dependent kinase 9
Synonyms:
C-2K CDK9 Cell division cycle 2-like protein kinase 4 Cyclin-Dependent Kinase 9 (CDK9) Serine/threonine-protein kinase PITALRE Tat-associated kinase complex catalytic subunit
Type:
Enzyme Subunit
Mol. Mass.:
42789.13
Organism:
Homo sapiens (Human)
Description:
Residue:
372
  
Inhibitor
Name:
BDBM50425008
Synonyms:
CHEMBL2312185
Type:
Small organic molecule
Emp. Form.:
C21H24N8S
Mol. Mass.:
420.534
SMILES:
CNc1nc(C)c(s1)-c1nc(Nc2cccc(c2)N2CCCNCC2)ncc1C#N
: