Target
Baculoviral IAP repeat-containing protein 3
Ligand
BDBM50425721
Substrate
Meas. Tech.
ChEMBL_937825 (CHEMBL2318322)
IC50
1.7±n/a nM
Citation
 Hashimoto, KSaito, BMiyamoto, NOguro, YTomita, DShiokawa, ZAsano, MKakei, HTaya, NKawasaki, MSumi, HYabuki, MIwai, KYoshida, SYoshimatsu, MAoyama, KKosugi, YKojima, TMorishita, NDougan, DRSnell, GPImamura, SIshikawa, T Design and synthesis of potent inhibitor of apoptosis (IAP) proteins antagonists bearing an octahydropyrrolo[1,2-a]pyrazine scaffold as a novel proline mimetic. J Med Chem 56:1228-46 (2013)  
Target
Name:
Baculoviral IAP repeat-containing protein 3
Synonyms:
API2 BIRC3_HUMAN Baculoviral IAP repeat-containing protein 3 (IAP1 BIR3) MIHC XIAP-BIR3 | cIAP1/cIAP2
Type:
Protein
Mol. Mass.:
68365.75
Organism:
Homo sapiens (Human)
Description:
Q13489
Residue:
604
  
Inhibitor
Name:
BDBM50425721
Synonyms:
CHEMBL2311586
Type:
Small organic molecule
Emp. Form.:
C29H39F4N5O4
Mol. Mass.:
597.6447
SMILES:
CN[C@@H](C)C(=O)N[C@@H](C1CCC(F)(F)CC1)C(=O)N1C[C@H]2CC(F)(F)CN2C[C@H]1C(=O)N[C@@H]1CCOc2ccccc12
: