Target
L-lactate dehydrogenase A chain
Ligand
BDBM50425794
Substrate
Meas. Tech.
ChEMBL_937561 (CHEMBL2320786)
Kd
222±n/a nM
Citation
 Kohlmann, AZech, SGLi, FZhou, TSquillace, RMCommodore, LGreenfield, MTLu, XMiller, DPHuang, WSQi, JThomas, RMWang, YZhang, SDodd, RLiu, SXu, RXu, YMiret, JJRivera, VClackson, TShakespeare, WCZhu, XDalgarno, DC Fragment growing and linking lead to novel nanomolar lactate dehydrogenase inhibitors. J Med Chem 56:1023-40 (2013)  
Target
Name:
L-lactate dehydrogenase A chain
Synonyms:
Cell proliferation-inducing gene 19 protein L-lactate dehydrogenase A Chain LDH-A LDHA Lactate dehydrogenase A (LDHA) | Renal carcinoma antigen NY-REN-59
Type:
Protein
Mol. Mass.:
36694.85
Organism:
Homo sapiens (Human)
Description:
P00338::PDB Code: 4ajp
Residue:
332
  
Inhibitor
Name:
BDBM50425794
Synonyms:
CHEMBL2316883
Type:
Small organic molecule
Emp. Form.:
C32H32ClFN4O9S
Mol. Mass.:
703.134
SMILES:
COc1cc(OC[C@@H](O)[C@@H](O)[C@H](O)[C@H](O)CNc2cc(F)cc(c2)-c2ccc(cn2)C(O)=O)c(Cl)cc1NC(=O)CSc1ccccn1
: