Target
D-aspartate oxidase
Ligand
BDBM50206007
Substrate
Meas. Tech.
ChEMBL_938789 (CHEMBL2327933)
IC50
7579000±n/a nM
Citation
 Katane, MOsaka, NMatsuda, SMaeda, KKawata, TSaitoh, YSekine, MFuruchi, TDoi, IHirono, SHomma, H Identification of novel D-amino acid oxidase inhibitors by in silico screening and their functional characterization in vitro. J Med Chem 56:1894-907 (2013)  
Target
Name:
D-aspartate oxidase
Synonyms:
D-Aspartate Oxidase (DDO) DDO | OXDD_HUMAN
Type:
Oxidoreductase
Mol. Mass.:
37543.06
Organism:
Homo sapiens (Human)
Description:
Recombinant human DDO expressed and purified from sf9 insect cells, was used in enzyme assays.
Residue:
341
  
Inhibitor
Name:
BDBM50206007
Synonyms:
3-Hydroxy-chromen-2-one CHEMBL150372
Type:
Small organic molecule
Emp. Form.:
C9H6O3
Mol. Mass.:
162.1421
SMILES:
Oc1cc2ccccc2oc1=O
: