Target
D-amino-acid oxidase
Ligand
BDBM31147
Substrate
Meas. Tech.
ChEMBL_938787 (CHEMBL2327931)
IC50
214±n/a nM
Citation
 Katane, MOsaka, NMatsuda, SMaeda, KKawata, TSaitoh, YSekine, MFuruchi, TDoi, IHirono, SHomma, H Identification of novel D-amino acid oxidase inhibitors by in silico screening and their functional characterization in vitro. J Med Chem 56:1894-907 (2013)  
Target
Name:
D-amino-acid oxidase
Synonyms:
D-amino-acid oxidase (DAAO) DAMOX OXDA_HUMAN
Type:
Homodimer
Mol. Mass.:
39476.06
Organism:
Homo sapiens (Human)
Description:
P14920
Residue:
347
  
Inhibitor
Name:
BDBM31147
Synonyms:
4H-furo[3,2-b]pyrrole-5-carboxylic acid CHEMBL492591
Type:
Small organic molecule
Emp. Form.:
C7H5NO3
Mol. Mass.:
151.1195
SMILES:
OC(=O)c1cc2occc2[nH]1
: