Target
Insulin-degrading enzyme
Ligand
BDBM50427702
Substrate
Meas. Tech.
ChEMBL_941898 (CHEMBL2329964)
Ki
927±n/a nM
Citation
 Abdul-Hay, SOLane, ALCaulfield, TRClaussin, CBertrand, JMasson, AChoudhry, SFauq, AHMaharvi, GMLeissring, MA Optimization of peptide hydroxamate inhibitors of insulin-degrading enzyme reveals marked substrate-selectivity. J Med Chem 56:2246-55 (2013)  
Target
Name:
Insulin-degrading enzyme
Synonyms:
Abeta-degrading protease IDE Insulin degrading enzyme (hIDE) Insulin-degrading enzyme Insulysin | insulin-degrading enzyme isoform 1 precursor
Type:
Enzyme Catalytic Domain
Mol. Mass.:
117968.59
Organism:
Homo sapiens (Human)
Description:
P14735
Residue:
1019
  
Inhibitor
Name:
BDBM50427702
Synonyms:
CHEMBL2324202
Type:
Small organic molecule
Emp. Form.:
C37H45N9O9
Mol. Mass.:
759.8081
SMILES:
NC(N)=NCCC[C@H](NC(=O)[C@H](Cc1ccc2ccccc2c1)[C@@H](O)C(=O)NO)C(=O)N[C@@H](Cc1c[nH]c2ccccc12)C(=O)N[C@@H](CCC(O)=O)C(N)=O
: