Target
Insulin-degrading enzyme
Ligand
BDBM50427708
Substrate
Meas. Tech.
ChEMBL_941899 (CHEMBL2329965)
Ki
7020±n/a nM
Citation
 Abdul-Hay, SOLane, ALCaulfield, TRClaussin, CBertrand, JMasson, AChoudhry, SFauq, AHMaharvi, GMLeissring, MA Optimization of peptide hydroxamate inhibitors of insulin-degrading enzyme reveals marked substrate-selectivity. J Med Chem 56:2246-55 (2013)  
Target
Name:
Insulin-degrading enzyme
Synonyms:
Abeta-degrading protease IDE Insulin degrading enzyme (hIDE) Insulin-degrading enzyme Insulysin | insulin-degrading enzyme isoform 1 precursor
Type:
Enzyme Catalytic Domain
Mol. Mass.:
117968.59
Organism:
Homo sapiens (Human)
Description:
P14735
Residue:
1019
  
Inhibitor
Name:
BDBM50427708
Synonyms:
CHEMBL2324214
Type:
Small organic molecule
Emp. Form.:
C21H28N6O5
Mol. Mass.:
444.4842
SMILES:
[#7]\[#6](-[#7])=[#7]/[#6]-[#6]-[#6]-[#6@H](-[#7]-[#6](=O)-[#6@H](-[#6]-c1ccc2ccccc2c1)-[#6@@H](-[#8])-[#6](=O)-[#7]-[#8])-[#6](-[#7])=O
: