Target
Neuronal acetylcholine receptor subunit alpha-7
Ligand
BDBM50428079
Substrate
Meas. Tech.
ChEMBL_941648 (CHEMBL2330766)
Ki
150000±n/a nM
Citation
 Liu, YRichardson, JTran, TAl-Muhtasib, NXie, TYenugonda, VMSexton, HGRezvani, AHLevin, EDSahibzada, NKellar, KJBrown, MLXiao, YPaige, M Chemistry and pharmacological studies of 3-alkoxy-2,5-disubstituted-pyridinyl compounds as novel selectivea4ß2 nicotinic acetylcholine receptor ligands that reduce alcohol intake in rats. J Med Chem 56:3000-11 (2013)  
Target
Name:
Neuronal acetylcholine receptor subunit alpha-7
Synonyms:
ACHA7_RAT Cholinergic, Nicotinic Alpha7 Chrna7 Neuronal acetylcholine receptor (alpha7 nAChR) Neuronal acetylcholine receptor subunit alpha-7 Neuronal acetylcholine receptor subunit alpha-7 (nAChR)
Type:
Enzyme
Mol. Mass.:
56502.44
Organism:
Rattus norvegicus (Rat)
Description:
Q05941
Residue:
502
  
Inhibitor
Name:
BDBM50428079
Synonyms:
CHEMBL2323569 | US9303017, 25, YL-1-199
Type:
Small organic molecule
Emp. Form.:
C15H18N2O
Mol. Mass.:
242.3162
SMILES:
Cc1ncc(cc1OC[C@@H]1CCN1)C#CC1CC1
: