Target
Neuronal acetylcholine receptor subunit alpha-7
Ligand
BDBM50382474
Substrate
Meas. Tech.
ChEMBL_941648 (CHEMBL2330766)
Ki
670±n/a nM
Citation
 Liu, YRichardson, JTran, TAl-Muhtasib, NXie, TYenugonda, VMSexton, HGRezvani, AHLevin, EDSahibzada, NKellar, KJBrown, MLXiao, YPaige, M Chemistry and pharmacological studies of 3-alkoxy-2,5-disubstituted-pyridinyl compounds as novel selectivea4ß2 nicotinic acetylcholine receptor ligands that reduce alcohol intake in rats. J Med Chem 56:3000-11 (2013)  
Target
Name:
Neuronal acetylcholine receptor subunit alpha-7
Synonyms:
ACHA7_RAT Cholinergic, Nicotinic Alpha7 Chrna7 Neuronal acetylcholine receptor (alpha7 nAChR) Neuronal acetylcholine receptor subunit alpha-7 Neuronal acetylcholine receptor subunit alpha-7 (nAChR)
Type:
Enzyme
Mol. Mass.:
56502.44
Organism:
Rattus norvegicus (Rat)
Description:
Q05941
Residue:
502
  
Inhibitor
Name:
BDBM50382474
Synonyms:
CHEMBL2024096 | US9303017, Sazetidine-A
Type:
Small organic molecule
Emp. Form.:
C15H20N2O2
Mol. Mass.:
260.3315
SMILES:
OCCCCC#Cc1cncc(OC[C@@H]2CCN2)c1
: