Target
Neuronal acetylcholine receptor subunit alpha-4/beta-2
Ligand
BDBM50428085
Substrate
Meas. Tech.
ChEMBL_941644 (CHEMBL2330762)
EC50
310±n/a nM
Citation
 Liu, YRichardson, JTran, TAl-Muhtasib, NXie, TYenugonda, VMSexton, HGRezvani, AHLevin, EDSahibzada, NKellar, KJBrown, MLXiao, YPaige, M Chemistry and pharmacological studies of 3-alkoxy-2,5-disubstituted-pyridinyl compounds as novel selectivea4ß2 nicotinic acetylcholine receptor ligands that reduce alcohol intake in rats. J Med Chem 56:3000-11 (2013)  
Target
Name:
Neuronal acetylcholine receptor subunit alpha-4/beta-2
Synonyms:
Neuronal acetylcholine receptor Alpha-4/Beta-2 Neuronal acetylcholine receptor; alpha4/beta2 | nAChR subtypes alpha4 beta2
Type:
Protein
Mol. Mass.:
Description:
Components:
This complex has 2 components.
Component 1
Name:
Neuronal acetylcholine receptor subunit alpha-4
Synonyms:
ACHA4_HUMAN CHRNA4 protein Neuronal acetylcholine receptor protein alpha-4 subunit Nicotinic acetylcholine receptor alpha4/beta2/alpha5
Type:
Mol. Mass.:
69963.49
Organism:
Homo sapiens (Human)
Description:
NACHRA4
Residue:
627
  
Component 2
Name:
Neuronal acetylcholine receptor subunit beta-2
Synonyms:
ACHB2_HUMAN Neuronal acetylcholine receptor protein beta-2 subunit | Nicotinic acetylcholine receptor alpha3/beta2/alpha5
Type:
Protein
Mol. Mass.:
57020.50
Organism:
Homo sapiens (Human)
Description:
P17787
Residue:
502
  
Inhibitor
Name:
BDBM50428085
Synonyms:
CHEMBL2323566 | US9303017, (S)-15, YL-1-127
Type:
Small organic molecule
Emp. Form.:
C16H22N2O
Mol. Mass.:
258.3587
SMILES:
CCCCC#Cc1cnc(C)c(OC[C@@H]2CCN2)c1
: