Target
Neutral ceramidase
Ligand
BDBM50428951
Substrate
Meas. Tech.
ChEMBL_947546 (CHEMBL2339252)
IC50
120000±n/a nM
Citation
 Bhabak, KPKleuser, BHuwiler, AArenz, C Effective inhibition of acid and neutral ceramidases by novel B-13 and LCL-464 analogues. Bioorg Med Chem 21:874-82 (2013)  
Target
Name:
Neutral ceramidase
Synonyms:
ASAH2 Acylsphingosine deacylase 2 HNAC1 N-CDase NCDase Non-lysosomal ceramidase | hCD
Type:
PROTEIN
Mol. Mass.:
85523.37
Organism:
Homo sapiens (Human)
Description:
ChEMBL_947546
Residue:
780
  
Inhibitor
Name:
BDBM50428951
Synonyms:
CHEMBL2333179
Type:
Small organic molecule
Emp. Form.:
C23H40N2O2
Mol. Mass.:
376.5759
SMILES:
C[C@@H](NC(=O)CCCCCCCCCCCN(C)C)[C@@H](O)c1ccccc1
: