Target
Pancreatic triacylglycerol lipase
Ligand
BDBM24567
Substrate
Meas. Tech.
ChEMBL_948540 (CHEMBL2343713)
IC50
600±n/a nM
Citation
 Park, CHChung, BYLee, SSBai, HWCho, JYJo, CKim, TH Radiolytic transformation of rotenone with potential anti-adipogenic activity. Bioorg Med Chem Lett 23:1099-103 (2013)  
Target
Name:
Pancreatic triacylglycerol lipase
Synonyms:
LIPP_PIG PNLIP Pancreatic lipase | Pancreatic triacylglycerol lipase
Type:
Enzyme
Mol. Mass.:
50080.69
Organism:
Sus scrofa (Pig)
Description:
P00591
Residue:
450
  
Inhibitor
Name:
BDBM24567
Synonyms:
(2S)-1-[(2S,3S)-3-hexyl-4-oxooxetan-2-yl]tridecan-2-yl (2S)-2-formamido-4-methylpentanoate Orlistat Tetrahydrolipstatin Xenical
Type:
Small organic molecule
Emp. Form.:
C29H53NO5
Mol. Mass.:
495.7348
SMILES:
CCCCCCCCCCC[C@@H](C[C@@H]1OC(=O)[C@H]1CCCCCC)OC(=O)[C@H](CC(C)C)NC=O
: