Target
D(2) dopamine receptor
Ligand
BDBM50424077
Substrate
Meas. Tech.
ChEMBL_942281 (CHEMBL2343279)
Ki
>5000±n/a nM
Citation
 Sun, HZhu, LYang, HQian, WGuo, LZhou, SGao, BLi, ZZhou, YJiang, HChen, KZhen, XLiu, H Asymmetric total synthesis and identification of tetrahydroprotoberberine derivatives as new antipsychotic agents possessing a dopamine D(1), D(2) and serotonin 5-HT(1A) multi-action profile. Bioorg Med Chem 21:856-68 (2013)  
Target
Name:
D(2) dopamine receptor
Synonyms:
D(2) dopamine receptor DOPAMINE D2 Long DRD2 Dopamine D2 receptor Dopamine D2 receptor (D2R) Dopamine2-like | d2
Type:
Cell-surface receptors
Mol. Mass.:
50647.10
Organism:
Homo sapiens (Human)
Description:
P14416
Residue:
443
  
Inhibitor
Name:
BDBM50424077
Synonyms:
(-)-Tetrahydropalmatine TETRAHYDROPALMATINE
Type:
Small organic molecule
Emp. Form.:
C21H25NO4
Mol. Mass.:
355.4275
SMILES:
COc1cc2CCN3Cc4c(C[C@H]3c2cc1OC)ccc(OC)c4OC
: