Target
Epithelial discoidin domain-containing receptor 1
Ligand
BDBM50430839
Substrate
Meas. Tech.
ChEMBL_945419 (CHEMBL2342530)
Kd
0.60±n/a nM
Citation
 Gao, MDuan, LLuo, JZhang, LLu, XZhang, YZhang, ZTu, ZXu, YRen, XDing, K Discovery and optimization of 3-(2-(Pyrazolo[1,5-a]pyrimidin-6-yl)ethynyl)benzamides as novel selective and orally bioavailable discoidin domain receptor 1 (DDR1) inhibitors. J Med Chem 56:3281-95 (2013)  
Target
Name:
Epithelial discoidin domain-containing receptor 1
Synonyms:
CAK DDR1_HUMAN Discoidin domain-containing receptor 1 (DDR1) EDDR1 Epithelial discoidin domain receptor 1 (DDR1) Epithelial discoidin domain-containing receptor 1 (DDR1) Mammary carcinoma kinase 10 NTRK4 Protein-tyrosine kinase RTK 6 TRKE | Tyrosine-protein kinase CAK
Type:
Tyrosine-protein kinase
Mol. Mass.:
101130.02
Organism:
Homo sapiens (Human)
Description:
Q08345
Residue:
913
  
Inhibitor
Name:
BDBM50430839
Synonyms:
CHEMBL2336015
Type:
Small organic molecule
Emp. Form.:
C30H29F3N6O
Mol. Mass.:
546.5861
SMILES:
CCc1ccc(cc1C#Cc1cnc2ccnn2c1)C(=O)Nc1cc(CN2CCN(C)CC2)cc(c1)C(F)(F)F
: