Target
D-amino-acid oxidase
Ligand
BDBM50431069
Substrate
Meas. Tech.
ChEMBL_947859 (CHEMBL2343135)
IC50
2.0±n/a nM
Citation
 Hondo, TWarizaya, MNiimi, TNamatame, IYamaguchi, TNakanishi, KHamajima, THarada, KSakashita, HMatsumoto, YOrita, MTakeuchi, M 4-Hydroxypyridazin-3(2H)-one derivatives as novel D-amino acid oxidase inhibitors. J Med Chem 56:3582-92 (2013)  
Target
Name:
D-amino-acid oxidase
Synonyms:
D-amino-acid oxidase (DAAO) DAMOX OXDA_HUMAN
Type:
Homodimer
Mol. Mass.:
39476.06
Organism:
Homo sapiens (Human)
Description:
P14920
Residue:
347
  
Inhibitor
Name:
BDBM50431069
Synonyms:
CHEMBL2338795 US10463663, Example 7 US9212147, 27 US9931340, Example 7
Type:
Small organic molecule
Emp. Form.:
C12H11FN2O2
Mol. Mass.:
234.2263
SMILES:
Oc1cc(CCc2ccccc2F)n[nH]c1=O
: