Target
RAC-alpha serine/threonine-protein kinase
Ligand
BDBM50431637
Substrate
Meas. Tech.
ChEMBL_950881 (CHEMBL2349705)
IC50
7000±n/a nM
Citation
 Alam, MMJoh, EHPark, HKim, BKim, DHLee, YS Synthesis, characterization and Akt phosphorylation inhibitory activity of cyclopentanecarboxylate-substituted alkylphosphocholines. Bioorg Med Chem 21:2018-24 (2013)  
Target
Name:
RAC-alpha serine/threonine-protein kinase
Synonyms:
AKT phosphorylation (p-AKT) AKT1/PPP1CA C-AKT PKB alpha Protein kinase B Protein kinase B (Akt 1) Protein kinase B alpha Proto-oncogene Akt (Akt1) Proto-oncogene c-Akt (AKT1) RAC-PK-alpha RAC-alpha serine/threonine-protein kinase (AKT1) | RAC-alpha serine/threonine-protein kinase (pAKT)
Type:
Enzyme
Mol. Mass.:
55681.25
Organism:
Homo sapiens (Human)
Description:
P31749
Residue:
480
  
Inhibitor
Name:
BDBM50431637
Synonyms:
CHEMBL2349077
Type:
Small organic molecule
Emp. Form.:
C33H66NO6P
Mol. Mass.:
603.854
SMILES:
[C@]1(CCC[C@H]1OP([O-])(=O)OCC[N+](C)(C)C)C(=O)OCC
: