Target
RAC-alpha serine/threonine-protein kinase
Ligand
BDBM50431640
Substrate
Meas. Tech.
ChEMBL_950881 (CHEMBL2349705)
IC50
3100±n/a nM
Citation
 Alam, MMJoh, EHPark, HKim, BKim, DHLee, YS Synthesis, characterization and Akt phosphorylation inhibitory activity of cyclopentanecarboxylate-substituted alkylphosphocholines. Bioorg Med Chem 21:2018-24 (2013)  
Target
Name:
RAC-alpha serine/threonine-protein kinase
Synonyms:
AKT phosphorylation (p-AKT) AKT1/PPP1CA C-AKT PKB alpha Protein kinase B Protein kinase B (Akt 1) Protein kinase B alpha Proto-oncogene Akt (Akt1) Proto-oncogene c-Akt (AKT1) RAC-PK-alpha RAC-alpha serine/threonine-protein kinase (AKT1) | RAC-alpha serine/threonine-protein kinase (pAKT)
Type:
Enzyme
Mol. Mass.:
55681.25
Organism:
Homo sapiens (Human)
Description:
P31749
Residue:
480
  
Inhibitor
Name:
BDBM50431640
Synonyms:
CHEMBL2349074
Type:
Small organic molecule
Emp. Form.:
C26H52NO6P
Mol. Mass.:
505.6679
SMILES:
CCCCCCCCCCCCC[C@]1(CCC[C@H]1OP([O-])(=O)OCC[N+](C)(C)C)C(=O)OCC
: