Target
Prostaglandin G/H synthase 2
Ligand
BDBM50029600
Substrate
Meas. Tech.
ChEMBL_951243 (CHEMBL2353244)
IC50
30±n/a nM
Citation
 Assadieskandar, AAmirhamzeh, ASalehi, MOzadali, KOstad, SNShafiee, AAmini, M Synthesis, cyclooxygenase inhibitory effects, and molecular modeling study of 4-aryl-5-(4-(methylsulfonyl)phenyl)-2-alkylthio and -2-alkylsulfonyl-1H-imidazole derivatives. Bioorg Med Chem 21:2355-62 (2013)  
Target
Name:
Prostaglandin G/H synthase 2
Synonyms:
COX2 Cyclooxygenase 2 (COX-2) Cyclooxygenase-2 (COX-2 AA) Cyclooxygenase-2 (COX-2) PGH2_HUMAN PHS II Prostaglandin E synthase/G/H synthase 2 Prostaglandin-endoperoxide synthase 2
Type:
Enzyme
Mol. Mass.:
69003.89
Organism:
Homo sapiens (Human)
Description:
Recombinant Cox-2 provided by Cayman (Cayman Chemical Co.,Ann Arbor, MI).
Residue:
604
  
Inhibitor
Name:
BDBM50029600
Synonyms:
5-Bromo-2-(4-fluoro-phenyl)-3-(4-methanesulfonyl-phenyl)-thiophene CHEMBL42485 | DUP-697
Type:
Small organic molecule
Emp. Form.:
C17H12BrFO2S2
Mol. Mass.:
411.308
SMILES:
CS(=O)(=O)c1ccc(cc1)-c1cc(Br)sc1-c1ccc(F)cc1
: