Target
Sodium-dependent serotonin transporter
Ligand
BDBM50432576
Substrate
Meas. Tech.
ChEMBL_950695 (CHEMBL2352938)
Ki
62±n/a nM
Citation
 Soubhye, JAldib, IElfving, BGelbcke, MFurtmüller, PGPodrecca, MConotte, RColet, JMRousseau, AReye, FSarakbi, AVanhaeverbeek, MKauffmann, JMObinger, CNève, JPrévost, MZouaoui Boudjeltia, KDufrasne, FVan Antwerpen, P Design, synthesis, and structure-activity relationship studies of novel 3-alkylindole derivatives as selective and highly potent myeloperoxidase inhibitors. J Med Chem 56:3943-58 (2013)  
Target
Name:
Sodium-dependent serotonin transporter
Synonyms:
5-HT Transporter 5HTT SC6A4_HUMAN SLC6A4 Serotonin transporter (5HTT) Sodium-dependent serotonin transporter (SERT) | Solute carrier family 6 member 4
Type:
Multi-pass membrane protein
Mol. Mass.:
70322.51
Organism:
Homo sapiens (Human)
Description:
P31645
Residue:
630
  
Inhibitor
Name:
BDBM50432576
Synonyms:
CHEMBL2347167
Type:
Small organic molecule
Emp. Form.:
C13H17FN2O
Mol. Mass.:
236.2853
SMILES:
OCCNCCCc1c[nH]c2ccc(F)cc12
: