Target
Sphingosine kinase 1
Ligand
BDBM50433312
Substrate
Meas. Tech.
ChEMBL_957868 (CHEMBL2378981)
EC50
5700±n/a nM
Citation
 Liu, ZMacRitchie, NPyne, SPyne, NJBittman, R Synthesis of (S)-FTY720 vinylphosphonate analogues and evaluation of their potential as sphingosine kinase 1 inhibitors and activators. Bioorg Med Chem 21:2503-10 (2013)  
Target
Name:
Sphingosine kinase 1
Synonyms:
SK1 SPHK1 SPK Sphingosine kinase 1 (SPHK1) | Sphingosine kinase types 1 (SphK1)
Type:
Enzyme
Mol. Mass.:
42521.16
Organism:
Homo sapiens (Human)
Description:
Q9NYA1
Residue:
384
  
Inhibitor
Name:
BDBM50433312
Synonyms:
CHEMBL2376443
Type:
Small organic molecule
Emp. Form.:
C20H31FN3O3P
Mol. Mass.:
411.4506
SMILES:
CCCCCCCCc1ccc(CC[C@@](CF)(\C=C\P(O)(O)=O)N=[N+]=[N-])cc1
: