Target
D-amino-acid oxidase
Ligand
BDBM50206007
Substrate
Meas. Tech.
ChEMBL_956972 (CHEMBL2378320)
Kd
4000±n/a nM
Citation
 Hopkins, SCHeffernan, MLSaraswat, LDBowen, CAMelnick, LHardy, LWOrsini, MAAllen, MSKoch, PSpear, KLFoglesong, RJSoukri, MChytil, MFang, QKJones, SWVarney, MAPanatier, AOliet, SHPollegioni, LPiubelli, LMolla, GNardini, MLarge, TH Structural, kinetic, and pharmacodynamic mechanisms of D-amino acid oxidase inhibition by small molecules. J Med Chem 56:3710-24 (2013)  
Target
Name:
D-amino-acid oxidase
Synonyms:
D-amino-acid oxidase (DAAO) DAMOX OXDA_HUMAN
Type:
Homodimer
Mol. Mass.:
39476.06
Organism:
Homo sapiens (Human)
Description:
P14920
Residue:
347
  
Inhibitor
Name:
BDBM50206007
Synonyms:
3-Hydroxy-chromen-2-one CHEMBL150372
Type:
Small organic molecule
Emp. Form.:
C9H6O3
Mol. Mass.:
162.1421
SMILES:
Oc1cc2ccccc2oc1=O
: