Target
Chymase
Ligand
BDBM50434110
Substrate
Meas. Tech.
ChEMBL_958460 (CHEMBL2383101)
IC50
240±n/a nM
Citation
 Taylor, SJPadyana, AKAbeywardane, ALiang, SHao, MHDe Lombaert, SProudfoot, JFarmer, BSLi, XCollins, BMartin, LAlbaugh, DRHill-Drzewi, MPullen, SSTakahashi, H Discovery of potent, selective chymase inhibitors via fragment linking strategies. J Med Chem 56:4465-81 (2013)  
Target
Name:
Chymase
Synonyms:
Alpha-chymase CMA1_HUMAN CYM Mast cell protease I
Type:
Enzyme
Mol. Mass.:
27340.12
Organism:
Homo sapiens (Human)
Description:
Residue:
247
  
Inhibitor
Name:
BDBM50434110
Synonyms:
CHEMBL2381484
Type:
Small organic molecule
Emp. Form.:
C22H22ClN3O4
Mol. Mass.:
427.881
SMILES:
CCCC(CC(O)=O)n1c2ccccc2n(Cc2cc(Cl)cc3NC(=O)Cc23)c1=O
: