Target
Chymase
Ligand
BDBM50434124
Substrate
Meas. Tech.
ChEMBL_958460 (CHEMBL2383101)
IC50
50±n/a nM
Citation
 Taylor, SJPadyana, AKAbeywardane, ALiang, SHao, MHDe Lombaert, SProudfoot, JFarmer, BSLi, XCollins, BMartin, LAlbaugh, DRHill-Drzewi, MPullen, SSTakahashi, H Discovery of potent, selective chymase inhibitors via fragment linking strategies. J Med Chem 56:4465-81 (2013)  
Target
Name:
Chymase
Synonyms:
Alpha-chymase CMA1_HUMAN CYM Mast cell protease I
Type:
Enzyme
Mol. Mass.:
27340.12
Organism:
Homo sapiens (Human)
Description:
Residue:
247
  
Inhibitor
Name:
BDBM50434124
Synonyms:
CHEMBL2381480
Type:
Small organic molecule
Emp. Form.:
C21H20BrN3O4S
Mol. Mass.:
490.37
SMILES:
CCCC(Cn1c2ccccc2n(Cc2cc(Br)cc3[nH]c(=O)sc23)c1=O)C(O)=O
: