Target
5'-AMP-activated protein kinase catalytic subunit alpha-1
Ligand
BDBM50434271
Substrate
Meas. Tech.
ChEMBL_961305 (CHEMBL2390481)
EC50
2100±n/a nM
Citation
 Yu, LFLi, YYSu, MBZhang, MZhang, WZhang, LNPang, TZhang, RTLiu, BLi, JYLi, JNan, FJ Development of Novel Alkene Oxindole Derivatives As Orally Efficacious AMP-Activated Protein Kinase Activators. ACS Med Chem Lett 4:475-80 (2013)  
Target
Name:
5'-AMP-activated protein kinase catalytic subunit alpha-1
Synonyms:
AAPK1_HUMAN AMP-activated protein kinase alpha-1/beta-2/gamma-2 AMPK subunit alpha-1 AMPK1 PRKAA1 | Tau-protein kinase PRKAA1
Type:
Protein
Mol. Mass.:
64023.62
Organism:
Homo sapiens (Human)
Description:
Q13131
Residue:
559
  
Inhibitor
Name:
BDBM50434271
Synonyms:
CHEMBL2385951
Type:
Small organic molecule
Emp. Form.:
C27H18N2O6
Mol. Mass.:
466.4416
SMILES:
OC(=O)c1cccc(CN2C(=O)\C(=C\c3ccc(o3)-c3cccc(c3)[N+]([O-])=O)c3ccccc23)c1
: