Target
Sialidase-3
Ligand
BDBM50331683
Substrate
Meas. Tech.
ChEMBL_960636 (CHEMBL2390089)
IC50
>1000000±n/a nM
Citation
 Albohy, AZhang, YSmutova, VPshezhetsky, AVCairo, CW Identification of Selective Nanomolar Inhibitors of the Human Neuraminidase, NEU4. ACS Med Chem Lett 4:532-7 (2013)  
Target
Name:
Sialidase-3
Synonyms:
NEU3 Sialidase 3 | Sialidase-3
Type:
PROTEIN
Mol. Mass.:
48257.99
Organism:
Homo sapiens (Human)
Description:
ChEMBL_461856
Residue:
428
  
Inhibitor
Name:
BDBM50331683
Synonyms:
(2R,3R,4S)-4-hydroxy-3-(2-(4-phenyl-1H-1,2,3-triazol-1-yl)acetamido)-2-((1R,2R)-1,2,3-trihydroxypropyl)-3,4-dihydro-2H-pyran-6-carboxylate | CHEMBL1289979
Type:
Small organic molecule
Emp. Form.:
C19H22N4O8
Mol. Mass.:
434.4
SMILES:
OC[C@@H](O)[C@@H](O)[C@@H]1OC(=C[C@H](O)[C@H]1NC(=O)Cn1cc(nn1)-c1ccccc1)C(O)=O
: