Target
Sialidase-1
Ligand
BDBM50331680
Substrate
Meas. Tech.
ChEMBL_960639 (CHEMBL2390092)
IC50
660000±n/a nM
Citation
 Albohy, AZhang, YSmutova, VPshezhetsky, AVCairo, CW Identification of Selective Nanomolar Inhibitors of the Human Neuraminidase, NEU4. ACS Med Chem Lett 4:532-7 (2013)  
Target
Name:
Sialidase-1
Synonyms:
NANH NEUR1_HUMAN | Sialidase 1
Type:
PROTEIN
Mol. Mass.:
45463.28
Organism:
Homo sapiens (Human)
Description:
ChEMBL_960639
Residue:
415
  
Inhibitor
Name:
BDBM50331680
Synonyms:
(2R,3R,4S)-3-acetamido-2-((1R,2R)-1,2-dihydroxy-3-(4-(3-hydroxypropyl)-1H-1,2,3-triazol-1-yl)propyl)-4-hydroxy-3,4-dihydro-2H-pyran-6-carboxylate | CHEMBL1289755
Type:
Small organic molecule
Emp. Form.:
C16H24N4O8
Mol. Mass.:
400.3838
SMILES:
CC(=O)N[C@@H]1[C@@H](O)C=C(O[C@H]1[C@H](O)[C@H](O)Cn1cc(CCCO)nn1)C(O)=O
: