Target
Sialidase-1
Ligand
BDBM50331675
Substrate
Meas. Tech.
ChEMBL_960639 (CHEMBL2390092)
IC50
170000±n/a nM
Citation
 Albohy, AZhang, YSmutova, VPshezhetsky, AVCairo, CW Identification of Selective Nanomolar Inhibitors of the Human Neuraminidase, NEU4. ACS Med Chem Lett 4:532-7 (2013)  
Target
Name:
Sialidase-1
Synonyms:
NANH NEUR1_HUMAN | Sialidase 1
Type:
PROTEIN
Mol. Mass.:
45463.28
Organism:
Homo sapiens (Human)
Description:
ChEMBL_960639
Residue:
415
  
Inhibitor
Name:
BDBM50331675
Synonyms:
(2R,3R,4S)-3-acetamido-2-((1R,2R)-3-(4-ethoxy-1H-1,2,3-triazol-1-yl)-1,2-dihydroxypropyl)-4-hydroxy-3,4-dihydro-2H-pyran-6-carboxylate | CHEMBL1289540
Type:
Small organic molecule
Emp. Form.:
C15H22N4O8
Mol. Mass.:
386.3572
SMILES:
CCOc1cn(C[C@@H](O)[C@@H](O)[C@@H]2OC(=C[C@H](O)[C@H]2NC(C)=O)C(O)=O)nn1
: