Target
D(2) dopamine receptor
Ligand
BDBM50434583
Substrate
Meas. Tech.
ChEMBL_962764 (CHEMBL2388819)
Ki
169±n/a nM
Citation
 Li, AMishra, YMalik, MWang, QLi, STaylor, MReichert, DELuedtke, RRMach, RH Evaluation of N-phenyl homopiperazine analogs as potential dopamine D3 receptor selective ligands. Bioorg Med Chem 21:2988-98 (2013)  
Target
Name:
D(2) dopamine receptor
Synonyms:
D(2) dopamine receptor DOPAMINE D2 Long DRD2 Dopamine D2 receptor Dopamine D2 receptor (D2R) Dopamine2-like | d2
Type:
Cell-surface receptors
Mol. Mass.:
50647.10
Organism:
Homo sapiens (Human)
Description:
P14416
Residue:
443
  
Inhibitor
Name:
BDBM50434583
Synonyms:
CHEMBL2386623
Type:
Small organic molecule
Emp. Form.:
C24H34N4O2
Mol. Mass.:
410.5524
SMILES:
CNc1ccc(cc1)C(=O)NCCCCN1CCCN(CC1)c1ccccc1OC
: