Target
D(2) dopamine receptor
Ligand
BDBM50434585
Substrate
Meas. Tech.
ChEMBL_962764 (CHEMBL2388819)
Ki
145±n/a nM
Citation
 Li, AMishra, YMalik, MWang, QLi, STaylor, MReichert, DELuedtke, RRMach, RH Evaluation of N-phenyl homopiperazine analogs as potential dopamine D3 receptor selective ligands. Bioorg Med Chem 21:2988-98 (2013)  
Target
Name:
D(2) dopamine receptor
Synonyms:
D(2) dopamine receptor DOPAMINE D2 Long DRD2 Dopamine D2 receptor Dopamine D2 receptor (D2R) Dopamine2-like | d2
Type:
Cell-surface receptors
Mol. Mass.:
50647.10
Organism:
Homo sapiens (Human)
Description:
P14416
Residue:
443
  
Inhibitor
Name:
BDBM50434585
Synonyms:
CHEMBL2386621
Type:
Small organic molecule
Emp. Form.:
C22H29BrN4O2
Mol. Mass.:
461.395
SMILES:
COc1ccccc1N1CCCN(CCCCNC(=O)c2ccc(Br)nc2)CC1
: