Target
D(2) dopamine receptor
Ligand
BDBM50434587
Substrate
Meas. Tech.
ChEMBL_962764 (CHEMBL2388819)
Ki
280±n/a nM
Citation
 Li, AMishra, YMalik, MWang, QLi, STaylor, MReichert, DELuedtke, RRMach, RH Evaluation of N-phenyl homopiperazine analogs as potential dopamine D3 receptor selective ligands. Bioorg Med Chem 21:2988-98 (2013)  
Target
Name:
D(2) dopamine receptor
Synonyms:
D(2) dopamine receptor DOPAMINE D2 Long DRD2 Dopamine D2 receptor Dopamine D2 receptor (D2R) Dopamine2-like | d2
Type:
Cell-surface receptors
Mol. Mass.:
50647.10
Organism:
Homo sapiens (Human)
Description:
P14416
Residue:
443
  
Inhibitor
Name:
BDBM50434587
Synonyms:
CHEMBL2386619
Type:
Small organic molecule
Emp. Form.:
C27H32FN3O2S
Mol. Mass.:
481.625
SMILES:
COc1ccccc1N1CCCN(CCCCNC(=O)c2ccc(s2)-c2ccc(F)cc2)CC1
: