Target
D(2) dopamine receptor
Ligand
BDBM50129429
Substrate
Meas. Tech.
ChEMBL_962764 (CHEMBL2388819)
Ki
198±n/a nM
Citation
 Li, AMishra, YMalik, MWang, QLi, STaylor, MReichert, DELuedtke, RRMach, RH Evaluation of N-phenyl homopiperazine analogs as potential dopamine D3 receptor selective ligands. Bioorg Med Chem 21:2988-98 (2013)  
Target
Name:
D(2) dopamine receptor
Synonyms:
D(2) dopamine receptor DOPAMINE D2 Long DRD2 Dopamine D2 receptor Dopamine D2 receptor (D2R) Dopamine2-like | d2
Type:
Cell-surface receptors
Mol. Mass.:
50647.10
Organism:
Homo sapiens (Human)
Description:
P14416
Residue:
443
  
Inhibitor
Name:
BDBM50129429
Synonyms:
9H-Fluorene-2-carboxylic acid {(E)-4-[4-(2,3-dichloro-phenyl)-piperazin-1-yl]-but-2-enyl}-amide CHEMBL304605 | N-(4-(4-(2,3-dichlorophenyl)piperazin-1-yl)but-2-enyl)-9H-fluorene-2-carboxamide
Type:
Small organic molecule
Emp. Form.:
C28H27Cl2N3O
Mol. Mass.:
492.439
SMILES:
Clc1cccc(N2CCN(C\C=C\CNC(=O)c3ccc-4c(Cc5ccccc-45)c3)CC2)c1Cl
: