Target
G-protein coupled receptor 55
Ligand
BDBM50398212
Substrate
Meas. Tech.
ChEMBL_963381 (CHEMBL2388878)
Kd
283791903±n/a nM
Citation
 Rempel, VVolz, NGläser, FNieger, MBräse, SMüller, CE Antagonists for the orphan G-protein-coupled receptor GPR55 based on a coumarin scaffold. J Med Chem 56:4798-810 (2013)  
Target
Name:
G-protein coupled receptor 55
Synonyms:
G protein-coupled receptor 55 GPR55_HUMAN
Type:
PROTEIN
Mol. Mass.:
36649.72
Organism:
Homo sapiens (Human)
Description:
ChEMBL_1292265
Residue:
319
  
Inhibitor
Name:
BDBM50398212
Synonyms:
CHEMBL2181549
Type:
Small organic molecule
Emp. Form.:
C20H20O3
Mol. Mass.:
308.371
SMILES:
CC(C)c1ccc(C)c2oc(=O)c(Cc3ccccc3O)cc12
: