Target
Dual specificity protein kinase CLK1
Ligand
BDBM50435425
Substrate
Meas. Tech.
ChEMBL_965913 (CHEMBL2394344)
IC50
16±n/a nM
Citation
 Coombs, TCTanega, CShen, MWang, JLAuld, DSGerritz, SWSchoenen, FJThomas, CJAubé, J Small-molecule pyrimidine inhibitors of the cdc2-like (Clk) and dual specificity tyrosine phosphorylation-regulated (Dyrk) kinases: development of chemical probe ML315. Bioorg Med Chem Lett 23:3654-61 (2013)  
Target
Name:
Dual specificity protein kinase CLK1
Synonyms:
CDC-like kinase 1 CDC2-like kinase 1 (CLK1) CLK1 Dual specificity protein kinase CLK1 Dual specificty protein kinase CLK1
Type:
Protein
Mol. Mass.:
57322.21
Organism:
Homo sapiens (Human)
Description:
P49759
Residue:
484
  
Inhibitor
Name:
BDBM50435425
Synonyms:
CHEMBL1904905
Type:
Small organic molecule
Emp. Form.:
C19H15Cl2N3O2
Mol. Mass.:
388.247
SMILES:
Clc1ccc(CNc2nccc(n2)-c2ccc3OCCOc3c2)cc1Cl
: