Target
Cytochrome P450 2B6
Ligand
BDBM50437066
Substrate
Meas. Tech.
ChEMBL_969297 (CHEMBL2405000)
IC50
>30000±n/a nM
Citation
 Gao, ZHurst, WJGuillot, ENagorny, RPruniaux, MPHendrix, JAGeorge, PG Synthesis, characterization, and biological assessment of the four stereoisomers of the H(3) receptor antagonist 5-fluoro-2-methyl-N-[2-methyl-4-(2-methyl[1,3']bipyrrolidinyl-1'-yl)phenyl]benzamide. Bioorg Med Chem Lett 23:4044-7 (2013)  
Target
Name:
Cytochrome P450 2B6
Synonyms:
CP2B6_HUMAN Cytochrome P450 2B6 (CYP2B6)
Type:
Protein
Mol. Mass.:
56289.75
Organism:
Homo sapiens (Human)
Description:
P20813
Residue:
491
  
Inhibitor
Name:
BDBM50437066
Synonyms:
CHEMBL2403551
Type:
Small organic molecule
Emp. Form.:
C24H30FN3O
Mol. Mass.:
395.5129
SMILES:
C[C@@H]1CCCN1[C@@H]1CCN(C1)c1ccc(NC(=O)c2cc(F)ccc2C)c(C)c1
: