Target
1-deoxy-D-xylulose 5-phosphate reductoisomerase
Ligand
BDBM50437793
Substrate
Meas. Tech.
ChEMBL_973766 (CHEMBL2412049)
IC50
140±n/a nM
Citation
 Jansson, AMWieckowska, ABjörkelid, CYahiaoui, SSooriyaarachchi, SLindh, MBergfors, TDharavath, SDesroses, MSuresh, SAndaloussi, MNikhil, RSreevalli, SSrinivasa, BRLarhed, MJones, TAKarlén, AMowbray, SL DXR inhibition by potent mono- and disubstituted fosmidomycin analogues. J Med Chem 56:6190-9 (2013)  
Target
Name:
1-deoxy-D-xylulose 5-phosphate reductoisomerase
Synonyms:
DXR_MYCTU | dxr
Type:
PROTEIN
Mol. Mass.:
42846.92
Organism:
Mycobacterium tuberculosis
Description:
ChEMBL_1474510
Residue:
413
  
Inhibitor
Name:
BDBM50437793
Synonyms:
CHEMBL2407193
Type:
Small organic molecule
Emp. Form.:
C19H19Cl2N4O5P
Mol. Mass.:
485.258
SMILES:
ON(CCC(c1ccc(Cl)c(Cl)c1)P(O)(O)=O)C(=O)c1cccc(Cn2cncn2)c1
: