Target
Serine/threonine-protein kinase PLK2
Ligand
BDBM50437841
Substrate
Meas. Tech.
ChEMBL_973992 (CHEMBL2410317)
IC50
>10000±n/a nM
Citation
 Laufer, RForrest, BLi, SWLiu, YSampson, PEdwards, LLang, YAwrey, DEMao, GPlotnikova, OLeung, GHodgson, RBeletskaya, IMason, JMLuo, XWei, XYao, YFeher, MBan, FKiarash, RGreen, EMak, TWPan, GPauls, HW The discovery of PLK4 inhibitors: (E)-3-((1H-Indazol-6-yl)methylene)indolin-2-ones as novel antiproliferative agents. J Med Chem 56:6069-87 (2013)  
Target
Name:
Serine/threonine-protein kinase PLK2
Synonyms:
PLK2 Polo-Like Kinase 2 Serine/threonine-protein kinase PLK2 Serum-inducible kinase
Type:
Serine/threonine-protein kinase
Mol. Mass.:
78259.87
Organism:
Homo sapiens (Human)
Description:
Full-length human PLK2 was expressed as GST-fusion protein using baculovirus expression system. GST-PLK2 was purified by using glutathione sepharose chromatography.
Residue:
685
  
Inhibitor
Name:
BDBM50437841
Synonyms:
CHEMBL2407900
Type:
Small organic molecule
Emp. Form.:
C29H28N6O2
Mol. Mass.:
492.5716
SMILES:
COc1ccc2NC(=O)\C(=C\c3ccc4c(\C=C\c5ccc(nc5)N5CCN(C)CC5)n[nH]c4c3)c2c1
: