Target
Sphingosine kinase 1
Ligand
BDBM50438126
Substrate
Meas. Tech.
ChEMBL_972984 (CHEMBL2412222)
EC50
1900±n/a nM
Citation
 Gustin, DJLi, YBrown, MLMin, XSchmitt, MJWanska, MWang, XConnors, RJohnstone, SCardozo, MCheng, ACJeffries, SFranks, BLi, SShen, SWong, MWesche, HXu, GCarlson, TJPlant, MMorgenstern, KRex, KSchmitt, JCoxon, AWalker, NKayser, FWang, Z Structure guided design of a series of sphingosine kinase (SphK) inhibitors. Bioorg Med Chem Lett 23:4608-16 (2013)  
Target
Name:
Sphingosine kinase 1
Synonyms:
SK1 SPHK1 SPK Sphingosine kinase 1 (SPHK1) | Sphingosine kinase types 1 (SphK1)
Type:
Enzyme
Mol. Mass.:
42521.16
Organism:
Homo sapiens (Human)
Description:
Q9NYA1
Residue:
384
  
Inhibitor
Name:
BDBM50438126
Synonyms:
CHEMBL2407197
Type:
Small organic molecule
Emp. Form.:
C27H37N3O2S
Mol. Mass.:
467.667
SMILES:
OC[C@H]1C[C@@H](O)CCN1CCc1ccc(Nc2nc(cs2)C23CC4CC(CC(C4)C2)C3)cc1
: