Target
Sphingosine kinase 1
Ligand
BDBM50438143
Substrate
Meas. Tech.
ChEMBL_972984 (CHEMBL2412222)
EC50
90±n/a nM
Citation
 Gustin, DJLi, YBrown, MLMin, XSchmitt, MJWanska, MWang, XConnors, RJohnstone, SCardozo, MCheng, ACJeffries, SFranks, BLi, SShen, SWong, MWesche, HXu, GCarlson, TJPlant, MMorgenstern, KRex, KSchmitt, JCoxon, AWalker, NKayser, FWang, Z Structure guided design of a series of sphingosine kinase (SphK) inhibitors. Bioorg Med Chem Lett 23:4608-16 (2013)  
Target
Name:
Sphingosine kinase 1
Synonyms:
SK1 SPHK1 SPK Sphingosine kinase 1 (SPHK1) | Sphingosine kinase types 1 (SphK1)
Type:
Enzyme
Mol. Mass.:
42521.16
Organism:
Homo sapiens (Human)
Description:
Q9NYA1
Residue:
384
  
Inhibitor
Name:
BDBM50438143
Synonyms:
CHEMBL2409891
Type:
Small organic molecule
Emp. Form.:
C24H26F3N3O2S
Mol. Mass.:
477.542
SMILES:
OC[C@H]1C[C@@H](O)CCN1CCc1ccc(Nc2nc(cs2)-c2ccc(cc2)C(F)(F)F)cc1
: