Target
Poly [ADP-ribose] polymerase 1
Ligand
BDBM50438256
Substrate
Meas. Tech.
ChEMBL_973100 (CHEMBL2412863)
Kd
>500000±n/a nM
Citation
 Gangloff, ARBrown, Jde Jong, RDougan, DRGrimshaw, CEHixon, MJennings, AKamran, RKiryanov, AO'Connell, STaylor, EVu, P Discovery of novel benzo[b][1,4]oxazin-3(4H)-ones as poly(ADP-ribose)polymerase inhibitors. Bioorg Med Chem Lett 23:4501-5 (2013)  
Target
Name:
Poly [ADP-ribose] polymerase 1
Synonyms:
(ARTD1 or PARP1) 2.4.2.30 ADPRT ARTD1 Human diphtheria toxin-like ADP-ribosyltransferase (ARTD1 or PARP1) NT-PARP-1 PARP1 PPOL Poly [ADP-ribose] polymerase 1 (PARP) Poly [ADP-ribose] polymerase 1 (PARP1) Poly [ADP-ribose] polymerase 1, 28-kDa form Poly [ADP-ribose] polymerase 1, processed C-terminus Poly [ADP-ribose] polymerase-1 Poly(ADP-ribose) polymerase-1 (ARTD1/PARP1) Protein poly-ADP-ribosyltransferase PARP1 | Synonyms=ADPRT
Type:
Mol. Mass.:
113114.22
Organism:
Homo sapiens (Human)
Description:
P09874
Residue:
1014
  
Inhibitor
Name:
BDBM50438256
Synonyms:
CHEMBL2407991
Type:
Small organic molecule
Emp. Form.:
C10H11NO2
Mol. Mass.:
177.1998
SMILES:
CC1(C)Oc2ccccc2NC1=O
: