Target
Cytochrome P450 2B6
Ligand
BDBM50438845
Substrate
Meas. Tech.
ChEMBL_977235 (CHEMBL2416906)
IC50
>20000±n/a nM
Citation
 Tukulula, MNjoroge, MMugumbate, GCGut, JRosenthal, PJBarteau, SStreckfuss, JHeudi, OKameni-Tcheudji, JChibale, K Tetrazole-based deoxyamodiaquines: synthesis, ADME/PK profiling and pharmacological evaluation as potential antimalarial agents. Bioorg Med Chem 21:4904-13 (2013)  
Target
Name:
Cytochrome P450 2B6
Synonyms:
CP2B6_HUMAN Cytochrome P450 2B6 (CYP2B6)
Type:
Protein
Mol. Mass.:
56289.75
Organism:
Homo sapiens (Human)
Description:
P20813
Residue:
491
  
Inhibitor
Name:
BDBM50438845
Synonyms:
CHEMBL2413882
Type:
Small organic molecule
Emp. Form.:
C25H28ClN7
Mol. Mass.:
461.99
SMILES:
CC(C)(C)n1nnnc1C(N1CCCC1)c1cccc(Nc2ccnc3cc(Cl)ccc23)c1
: