Target
DNA-(apurinic or apyrimidinic site) endonuclease
Ligand
BDBM50438865
Substrate
Meas. Tech.
ChEMBL_978866 (CHEMBL2423657)
IC50
>200000±n/a nM
Citation
 Raoof, ADepledge, PHamilton, NMHamilton, NSHitchin, JRHopkins, GVJordan, AMMaguire, LAMcGonagle, AEMould, DPRushbrooke, MSmall, HFSmith, KMThomson, GJTurlais, FWaddell, IDWaszkowycz, BWatson, AJOgilvie, DJ Toxoflavins and deazaflavins as the first reported selective small molecule inhibitors of tyrosyl-DNA phosphodiesterase II. J Med Chem 56:6352-70 (2013)  
Target
Name:
DNA-(apurinic or apyrimidinic site) endonuclease
Synonyms:
APE APEX APEX1_HUMAN Apurinic-apyrimidinic endonuclease 1 (APE-1) DNA-(apurinic or apyrimidinic site) lyase REF1
Type:
Protein
Mol. Mass.:
35560.12
Organism:
Homo sapiens (Human)
Description:
P27695
Residue:
318
  
Inhibitor
Name:
BDBM50438865
Synonyms:
2,4-Dioxo-10-phenyl-pyrimido[4,5-b]quinoline-8-carbonitrile (3) | CHEMBL2420506
Type:
Small organic molecule
Emp. Form.:
C18H10N4O2
Mol. Mass.:
314.2976
SMILES:
O=c1nc2n(-c3ccccc3)c3cc(ccc3cc2c(=O)[nH]1)C#N
: