Target
Tyrosyl-DNA phosphodiesterase 2
Ligand
BDBM36527
Substrate
Meas. Tech.
ChEMBL_978867 (CHEMBL2423658)
EC50
780±n/a nM
Citation
 Raoof, ADepledge, PHamilton, NMHamilton, NSHitchin, JRHopkins, GVJordan, AMMaguire, LAMcGonagle, AEMould, DPRushbrooke, MSmall, HFSmith, KMThomson, GJTurlais, FWaddell, IDWaszkowycz, BWatson, AJOgilvie, DJ Toxoflavins and deazaflavins as the first reported selective small molecule inhibitors of tyrosyl-DNA phosphodiesterase II. J Med Chem 56:6352-70 (2013)  
Target
Name:
Tyrosyl-DNA phosphodiesterase 2
Synonyms:
EAP2 ETS1-associated protein 2 TDP2 TTRAP Tyr-DNA phosphodiesterase 2 Tyrosyl-DNA phosphodiesterase 2 (hTDP2) VPg unlinkase | hTDP2
Type:
Enzyme Catalytic Domain
Mol. Mass.:
40916.54
Organism:
Homo sapiens (Human)
Description:
gi_23510348
Residue:
362
  
Inhibitor
Name:
BDBM36527
Synonyms:
1,6-dimethyl-3-phenyl-1H,5H,6H,7H-pyrimido[5,4-e][1,2,4]triazine-5,7-dione, 10 | US9073941, 601
Type:
Small organic molecule
Emp. Form.:
C13H11N5O2
Mol. Mass.:
269.2587
SMILES:
Cn1nc(nc2c1nc(=O)n(C)c2=O)-c1ccccc1
: