Target
Tyrosyl-DNA phosphodiesterase 2
Ligand
BDBM50438849
Substrate
Meas. Tech.
ChEMBL_978867 (CHEMBL2423658)
EC50
370±n/a nM
Citation
 Raoof, ADepledge, PHamilton, NMHamilton, NSHitchin, JRHopkins, GVJordan, AMMaguire, LAMcGonagle, AEMould, DPRushbrooke, MSmall, HFSmith, KMThomson, GJTurlais, FWaddell, IDWaszkowycz, BWatson, AJOgilvie, DJ Toxoflavins and deazaflavins as the first reported selective small molecule inhibitors of tyrosyl-DNA phosphodiesterase II. J Med Chem 56:6352-70 (2013)  
Target
Name:
Tyrosyl-DNA phosphodiesterase 2
Synonyms:
EAP2 ETS1-associated protein 2 TDP2 TTRAP Tyr-DNA phosphodiesterase 2 Tyrosyl-DNA phosphodiesterase 2 (hTDP2) VPg unlinkase | hTDP2
Type:
Enzyme Catalytic Domain
Mol. Mass.:
40916.54
Organism:
Homo sapiens (Human)
Description:
gi_23510348
Residue:
362
  
Inhibitor
Name:
BDBM50438849
Synonyms:
CHEMBL2420479
Type:
Small organic molecule
Emp. Form.:
C19H10N6O2
Mol. Mass.:
354.3217
SMILES:
O=c1nc2n(-c3cccc4[nH]ncc34)c3cc(ccc3cc2c(=O)[nH]1)C#N
: