Target
Tyrosyl-DNA phosphodiesterase 2
Ligand
BDBM50438861
Substrate
Meas. Tech.
ChEMBL_978867 (CHEMBL2423658)
EC50
470±n/a nM
Citation
 Raoof, ADepledge, PHamilton, NMHamilton, NSHitchin, JRHopkins, GVJordan, AMMaguire, LAMcGonagle, AEMould, DPRushbrooke, MSmall, HFSmith, KMThomson, GJTurlais, FWaddell, IDWaszkowycz, BWatson, AJOgilvie, DJ Toxoflavins and deazaflavins as the first reported selective small molecule inhibitors of tyrosyl-DNA phosphodiesterase II. J Med Chem 56:6352-70 (2013)  
Target
Name:
Tyrosyl-DNA phosphodiesterase 2
Synonyms:
EAP2 ETS1-associated protein 2 TDP2 TTRAP Tyr-DNA phosphodiesterase 2 Tyrosyl-DNA phosphodiesterase 2 (hTDP2) VPg unlinkase | hTDP2
Type:
Enzyme Catalytic Domain
Mol. Mass.:
40916.54
Organism:
Homo sapiens (Human)
Description:
gi_23510348
Residue:
362
  
Inhibitor
Name:
BDBM50438861
Synonyms:
CHEMBL2420467
Type:
Small organic molecule
Emp. Form.:
C19H12N4O3
Mol. Mass.:
344.3236
SMILES:
COc1cccc(c1)-n1c2cc(ccc2cc2c1nc(=O)[nH]c2=O)C#N
: