Target
Hepatocyte growth factor receptor
Ligand
BDBM50439760
Substrate
Meas. Tech.
ChEMBL_980906 (CHEMBL2421441)
IC50
46±n/a nM
Citation
 Qi, BMi, BZhai, XXu, ZZhang, XTian, ZGong, P Discovery and optimization of novel 4-phenoxy-6,7-disubstituted quinolines possessing semicarbazones as c-Met kinase inhibitors. Bioorg Med Chem 21:5246-60 (2013)  
Target
Name:
Hepatocyte growth factor receptor
Synonyms:
Hepatocyte growth factor receptor Hepatocyte growth factor receptor (c-MET) MET Met proto-oncogene (hepatocyte growth factor receptor) Tyrosine-protein kinase Met (c-Met) c-Met kinase
Type:
Protein
Mol. Mass.:
155559.73
Organism:
Homo sapiens (Human)
Description:
P08581
Residue:
1390
  
Inhibitor
Name:
BDBM50439760
Synonyms:
CHEMBL2419645
Type:
Small organic molecule
Emp. Form.:
C34H38FN5O4
Mol. Mass.:
599.695
SMILES:
CCC(=NNC(=O)Nc1ccc(Oc2ccnc3cc(OCCCN4CCCCC4)c(OC)cc23)c(F)c1)c1ccccc1
: