Target
Hepatocyte growth factor receptor
Ligand
BDBM50439775
Substrate
Meas. Tech.
ChEMBL_980906 (CHEMBL2421441)
IC50
13±n/a nM
Citation
 Qi, BMi, BZhai, XXu, ZZhang, XTian, ZGong, P Discovery and optimization of novel 4-phenoxy-6,7-disubstituted quinolines possessing semicarbazones as c-Met kinase inhibitors. Bioorg Med Chem 21:5246-60 (2013)  
Target
Name:
Hepatocyte growth factor receptor
Synonyms:
Hepatocyte growth factor receptor Hepatocyte growth factor receptor (c-MET) MET Met proto-oncogene (hepatocyte growth factor receptor) Tyrosine-protein kinase Met (c-Met) c-Met kinase
Type:
Protein
Mol. Mass.:
155559.73
Organism:
Homo sapiens (Human)
Description:
P08581
Residue:
1390
  
Inhibitor
Name:
BDBM50439775
Synonyms:
CHEMBL2419666
Type:
Small organic molecule
Emp. Form.:
C32H33F2N5O4
Mol. Mass.:
589.6323
SMILES:
COc1cc2c(Oc3ccc(NC(=O)NN=Cc4ccccc4F)cc3F)ccnc2cc1OCCCN1CCCCC1
: