Target
Muscarinic acetylcholine receptor M2
Ligand
BDBM50005342
Substrate
Meas. Tech.
ChEMBL_982012 (CHEMBL2428367)
Ki
871±n/a nM
Citation
 McClure, KFJackson, MCameron, KOKung, DWPerry, DAOrr, STZhang, YKohrt, JTu, MGao, HFernando, DJones, RErasga, NWang, GPolivkova, JJiao, WSwartz, RUeno, HBhattacharya, SKStock, IAVarma, SBagdasarian, VPerez, SKelly-Sullivan, DWang, RKong, JCornelius, PMichael, LLee, EJanssen, ASteyn, SJLapham, KGoosen, T Identification of potent, selective, CNS-targeted inverse agonists of the ghrelin receptor. Bioorg Med Chem Lett 23:5410-4 (2013)  
Target
Name:
Muscarinic acetylcholine receptor M2
Synonyms:
ACM2_HUMAN Cholinergic, muscarinic M2 Muscarinic acetylcholine receptor M2 and M5 | RecName: Full=Muscarinic acetylcholine receptor M2
Type:
GPCR
Mol. Mass.:
51730.61
Organism:
Homo sapiens (Human)
Description:
P08172
Residue:
466
  
Inhibitor
Name:
BDBM50005342
Synonyms:
CHEMBL2426675
Type:
Small organic molecule
Emp. Form.:
C29H32N4O2
Mol. Mass.:
468.59
SMILES:
COc1ccc(CC(=O)N2CCC3(CN(C3)C3CCc4cc(ccc34)-c3ncccn3)CC2)cc1
: