Target
Cytochrome P450 2C19
Ligand
BDBM50440358
Substrate
Meas. Tech.
ChEMBL_983547 (CHEMBL2429617)
IC50
>10000±n/a nM
Citation
 Grädler, UBomke, JMusil, DDresing, VLehmann, MHölzemann, GGreiner, HEsdar, CKrier, MHeinrich, T Fragment-based discovery of focal adhesion kinase inhibitors. Bioorg Med Chem Lett 23:5401-9 (2013)  
Target
Name:
Cytochrome P450 2C19
Synonyms:
(R)-limonene 6-monooxygenase (S)-limonene 7-monooxygenase CYP2C19 CYPIIC19 Cytochrome P450 2C19 [I331V] Cytochrome P450-254C Mephenytoin 4-hydroxylase P450-254C
Type:
Enzyme
Mol. Mass.:
55935.47
Organism:
Homo sapiens (Human)
Description:
P33261
Residue:
490
  
Inhibitor
Name:
BDBM50440358
Synonyms:
CHEMBL2425156
Type:
Small organic molecule
Emp. Form.:
C26H27N5O
Mol. Mass.:
425.5255
SMILES:
Cc1ccc(cc1)-n1nc(cc1NC(=O)Nc1ccc(cc1)-c1cccnc1)C(C)(C)C
: