Target
Cytochrome P450 1A2
Ligand
BDBM50440358
Substrate
Meas. Tech.
ChEMBL_983551 (CHEMBL2429621)
IC50
>10000±n/a nM
Citation
 Grädler, UBomke, JMusil, DDresing, VLehmann, MHölzemann, GGreiner, HEsdar, CKrier, MHeinrich, T Fragment-based discovery of focal adhesion kinase inhibitors. Bioorg Med Chem Lett 23:5401-9 (2013)  
Target
Name:
Cytochrome P450 1A2
Synonyms:
CP1A2_HUMAN CYPIA2 Cytochrome P(3)450 Cytochrome P450 1A2 (CYP1A2) Cytochrome P450-P3
Type:
Enzyme
Mol. Mass.:
58423.38
Organism:
Homo sapiens (Human)
Description:
P05177
Residue:
516
  
Inhibitor
Name:
BDBM50440358
Synonyms:
CHEMBL2425156
Type:
Small organic molecule
Emp. Form.:
C26H27N5O
Mol. Mass.:
425.5255
SMILES:
Cc1ccc(cc1)-n1nc(cc1NC(=O)Nc1ccc(cc1)-c1cccnc1)C(C)(C)C
: