Target
Acetylcholine receptor subunit alpha/Neuronal acetylcholine receptor subunit beta-2
Ligand
BDBM50441458
Substrate
Meas. Tech.
ChEMBL_988318 (CHEMBL2439884)
Ki
>10000±n/a nM
Citation
 Dukat, MAlix, KWorsham, JKhatri, SSchulte, MK 2-Amino-6-chloro-3,4-dihydroquinazoline: A novel 5-HT3 receptor antagonist with antidepressant character. Bioorg Med Chem Lett 23:5945-8 (2013)  
Target
Name:
Acetylcholine receptor subunit alpha/Neuronal acetylcholine receptor subunit beta-2
Synonyms:
Nicotinic acetylcholine receptor alpha2/beta2
Type:
Mol. Mass.:
Description:
ASSAY_ID of ChEMBL is 964980
Components:
This complex has 2 components.
Component 1
Name:
Acetylcholine receptor subunit alpha
Synonyms:
ACHA_HUMAN Acetylcholine receptor protein alpha chain CHNRA Cholinergic, Nicotinic Alpha1Beta1DeltaGamma Nicotinic acetylcholine receptor alpha-1/beta-1 Nicotinic acetylcholine receptor alpha2/beta4 n-AChR
Type:
Ion channel
Mol. Mass.:
54542.01
Organism:
Homo sapiens (Human)
Description:
Residue:
482
  
Component 2
Name:
Neuronal acetylcholine receptor subunit beta-2
Synonyms:
ACHB2_HUMAN Neuronal acetylcholine receptor protein beta-2 subunit | Nicotinic acetylcholine receptor alpha3/beta2/alpha5
Type:
Protein
Mol. Mass.:
57020.50
Organism:
Homo sapiens (Human)
Description:
P17787
Residue:
502
  
Inhibitor
Name:
BDBM50441458
Synonyms:
CHEMBL2436555
Type:
Small organic molecule
Emp. Form.:
C8H8ClN3
Mol. Mass.:
181.622
SMILES:
NC1=NCc2cc(Cl)ccc2N1
: